{"text_format":"1","workbook":"xlsx","n_sheets":15,"sheets":["Instructions","Federal standards","State rules","Hot mix asphalt","Load out and silos","Generator","Natural gas (auxilary heat)","Propane (auxilary heat)","Fugitive","Potential emissions","Actual emissions","Permits & requirements","Hot mix emission factors","Engine Emission Factors","Data Validation"],"not_rendered":{"charts":0,"images":2,"macros":1,"external_links":0,"defined_names":49,"comments":4,"pivot_tables":0},"unopened":[],"bounds":{"document_bytes":16777216,"sheet_cells":100000,"rows_first":2000,"rows_last":500,"rows_between":2000,"halvings":0,"cell_chars":16384,"cell_head_chars":4096},"cells_cut":0,"cells_raw":0,"read":"whole","date_system":"1900"}

{"sheet":"Instructions","index":0,"n_rows":30,"n_cols":15,"rows_kept":30,"cut":false,"hidden":false,"merged":[[0,6,0,14],[0,1,3,5],[13,2,13,14],[14,2,14,14],[4,1,4,14],[12,1,12,14],[6,1,6,14],[9,1,9,14],[7,1,7,14],[8,1,8,14],[5,1,5,14],[10,1,11,14],[15,2,15,14],[16,2,16,14],[17,2,17,14],[18,2,18,14],[19,1,19,13],[20,1,20,13],[27,4,27,8],[29,1,29,2],[25,2,25,3],[25,4,25,14],[21,1,21,14],[23,1,23,14],[22,1,22,14],[24,2,24,3],[24,5,24,8],[29,3,29,8]]}
[null,null,null,null,null,null,"Hot mix asphalt\nair emissions calculator"]
[]
[null,null,null,null,null,null,null,null,null,null,null,null,null,null,"p-sbap5-20  •  4/8/19"]
[]
[null,"Instructions"]
[null,"1) Begin with the first blue tab. "]
[null,"2) Use the blue tabs across the bottom to enter information for your business."]
[null,"3) The green tabs total all potential and actual emissions from the information entered on the blue tabs."]
{"$rows_left_out":23}
{"sheet":"Federal standards","index":1,"n_rows":69,"n_cols":14,"rows_kept":69,"cut":false,"hidden":false,"merged":[[56,13,57,14],[51,13,55,14],[24,4,24,9],[40,1,40,12],[42,1,43,12],[44,1,44,12],[38,1,38,12],[36,2,36,12],[37,13,38,14],[37,2,37,12],[28,4,28,10],[50,1,50,12],[50,13,50,14],[53,2,53,12],[46,13,47,14],[47,1,48,12],[16,1,16,12],[19,1,19,12],[35,1,35,12],[46,10,46,11],[46,2,46,9],[26,4,26,5],[27,4,27,10],[26,6,26,8],[41,1,41,12],[29,1,30,12],[25,6,25,8],[42,13,45,14],[6,14,11,14],[7,1,8,1],[7,2,8,13],[9,1,11,1],[32,13,36,14],[9,2,11,13],[20,1,20,2],[20,3,20,5],[21,3,21,7],[17,2,17,12],[18,2,18,12],[12,1,12,14],[13,1,13,14],[3,1,5,7],[3,8,5,14],[20,6,20,12],[34,2,34,8],[34,9,34,12],[14,1,14,14],[20,13,21,14],[21,1,21,2],[15,1,15,12],[15,13,15,14],[33,2,33,7],[31,1,31,12],[16,13,19,14],[23,3,23,9],[31,13,31,14],[32,1,32,12],[69,1,69,14],[39,1,39,14],[41,13,41,14],[55,1,55,12],[52,2,52,7],[52,9,52,12],[45,2,45,5],[45,6,45,12],[68,1,68,7],[68,8,68,9],[68,10,68,12],[68,13,68,14],[66,2,66,14],[64,1,65,1],[64,2,65,14],[56,2,56,12],[67,1,67,14],[63,2,63,14],[51,1,51,12],[0,1,0,14],[49,1,49,14],[54,2,54,12],[6,2,6,13],[33,9,33,12],[57,2,57,12],[58,1,58,12],[59,1,59,12],[61,1,62,14],[60,1,60,14],[25,4,25,5],[1,1,1,14],[2,1,2,14]]}
[null,{"$f":"Instructions!$O$3","v":"p-sbap5-20  •  4/8/19"}]
[null,"U.S. Environmental Protection Agency (EPA) standards"]
[]
[null,"New source performance standards (NSPS) require new emission sources to be less polluting than older sources.",null,null,null,null,null,null,"National emission standards for hazardous air pollutants (NESHAP) prevent or reduce emissions that have health impacts."]
[]
[]
[null,"▪ ","Each NSPS or NESHAP applies to specific equipment, processes, or industries. "]
[null,"▪ ","Multiple federal standards may apply to your business. It is possible that if you make a change at your business, a federal standard that did not previously apply now will, or the one you are already following may have additional requirements."]
{"$rows_left_out":62}
{"sheet":"State rules","index":2,"n_rows":35,"n_cols":12,"rows_kept":35,"cut":false,"hidden":false,"merged":[[1,1,1,14],[5,1,6,14],[8,1,9,14],[4,1,4,14],[2,1,2,14],[3,1,3,14],[7,1,7,14],[12,3,15,8],[12,9,15,14],[11,1,11,14],[22,1,23,14],[24,1,24,14],[28,5,28,6],[16,3,19,14],[28,7,28,8],[29,5,29,6],[21,2,21,8],[21,9,21,14],[0,1,0,14],[34,2,34,10],[34,11,34,12],[28,10,29,14],[30,10,30,14],[29,7,29,8],[30,5,30,6],[30,7,30,8],[33,1,33,14],[31,1,32,14],[29,3,29,4],[10,1,10,14],[26,2,27,14],[30,3,30,4],[28,3,28,4],[20,3,20,14]]}
[null,{"$f":"Instructions!$O$3","v":"p-sbap5-20  •  4/8/19"}]
[null,"State rules for hot mix asphalt plants"]
[null,"All hot mix asphalt facilities must comply with these state rules."]
[]
[null,"Operating requirements"]
[null,"Compliance must be demonstrated through inspections, maintenance, monitoring, testing, recordkeeping, and reporting requirements. These requirements are listed on the hot mix asphalt 'Complying with air requirements' webpage."]
[]
[null,"https://www.pca.state.mn.us/regulations/hot-mix-asphalt-plants-complying-air-requirements"]
{"$rows_left_out":28}
{"sheet":"Hot mix asphalt","index":3,"n_rows":102,"n_cols":10,"rows_kept":102,"cut":false,"hidden":false,"merged":[[98,1,98,4],[6,1,6,3],[7,1,7,3],[8,1,8,3],[18,1,18,5],[20,1,20,5],[9,1,9,6],[18,6,18,7],[12,5,12,9],[15,1,15,3],[16,1,16,3],[17,1,17,9],[12,1,12,3],[16,5,16,9],[18,8,18,9],[1,1,1,9],[101,5,101,9],[99,5,100,9],[97,1,97,9],[98,5,98,8],[5,2,5,3],[5,4,5,5],[6,4,6,5],[22,1,22,9],[2,1,2,9],[14,1,14,5],[13,1,13,9],[11,1,11,9],[3,1,3,9],[4,4,4,5],[99,1,101,4],[11,12,11,13],[10,12,10,14],[5,9,6,9],[4,6,4,8],[5,6,5,8],[6,6,6,8]]}
[null,null,null,null,null,null,null,null,null,{"$f":"Instructions!$O$3","v":"p-sbap5-20  •  4/8/19"}]
[null,"Air emissions from hot mix asphalt plants"]
[null,"Facility information"]
[]
[null,null,null,"Facility name:",null,null,"If you are using a different fuel in the dryer:",null,null,"Choose which one"]
[null,null,"Plant type",null,"Choose one",null,{"$f":"IF(J5=\"Choose which one\",\" \",\"Then, choose this as your fuel type ------->\")","v":" "},null,null,{"$f":"IF(J5=\"Choose which one\",\" \",IF(OR(J5='Data Validation'!B20,OR(J5='Data Validation'!B21,J5='Data Validation'!B22)),'Data Validation'!C20,IF(OR(J5='Data Validation'!B23,OR(J5='Data Validation'!B27,OR(J5='Data Validation'!B28,J5='Data Validation'!B29))),'Data Validation'!C23,IF(OR(J5='Data Validation'!B24,OR(J5='Data Validation'!B25,'Data Validation'!B26)),'Data Validation'!C24))))","v":" "}]
[null,"What fuel is used in your dryer?",null,null,"Choose one",null,{"$f":"IF(J5=\"Choose which one\",\" \",\"<---------------------------------------- Choose from drop-down list\")","v":" "}]
[null,"What is your maximum production rate?",null,null,null,"tons of mix per hour"]
{"$rows_left_out":95}
{"sheet":"Load out and silos","index":4,"n_rows":66,"n_cols":16,"rows_kept":66,"cut":false,"hidden":false,"merged":[[65,9,65,15],[19,1,19,7],[19,9,19,15],[43,1,43,7],[43,9,43,15],[64,1,64,7],[64,9,64,15],[22,1,22,7],[22,9,22,15],[63,9,63,15],[63,1,63,7],[1,1,1,7],[2,1,2,7],[13,1,13,7],[13,9,13,15],[4,1,4,4],[8,9,8,15],[8,1,8,7]]}
[null,null,null,null,null,null,null,{"$f":"Instructions!$O$3","v":"p-sbap5-20  •  4/8/19"}]
[null,"Air emissions from hot mix asphalt plants"]
[null,"Load outs and silo filling"]
[]
[null,"Do you have site specific asphalt volatility and hot mix temperature?",null,null,null,"Choose one"]
[null,null,null,"Asphalt volatility",null,"where a 0.5 percent loss-on-heating is expressed as “-0.5”"]
[null,null,null,"Hot mix asphalt temperature",null,"degrees Fahrenheit (°F)"]
[]
{"$rows_left_out":59}
{"sheet":"Generator","index":5,"n_rows":62,"n_cols":11,"rows_kept":62,"cut":false,"hidden":false,"merged":[[1,1,1,10],[2,1,2,8],[4,1,4,3],[4,4,4,5],[4,6,4,7],[5,1,5,3],[5,5,5,8],[6,1,6,3],[6,5,6,8],[7,1,7,3],[7,5,7,8],[8,1,8,3],[8,5,8,8],[9,1,9,3],[9,5,9,8],[10,1,10,3],[10,5,10,8],[11,1,11,8],[12,1,12,8],[14,1,15,1],[14,2,15,2],[14,3,15,3],[14,4,15,4],[14,5,15,5],[14,6,15,6],[14,7,15,7],[14,8,15,8],[61,1,61,4],[61,5,61,6],[14,10,15,10],[16,10,17,10],[32,6,32,8],[59,1,59,4],[59,5,60,8],[60,1,60,4]]}
[null,null,null,null,null,null,null,null,null,null,{"$f":"Instructions!$O$3","v":"p-sbap5-20  •  4/8/19"}]
[null,"Air emissions from internal combustion engines"]
[null,"Reciprocating internal combustion engine (RICE)"]
[]
[null,"Engine and fuel type",null,null,"Choose one",null,"Facility identifier for engine",null,"Generator"]
[null,"Engine use",null,null,"Choose one","If emergency engine is used for peak-shaving or contracted for >15 hr/yr, choose 'Routine.'"]
[null,{"$f":"IF(E5='Data Validation'!D6,\" \",IF(OR(E5=rd,E5=rg),\"Rated mechanical output\",IF(OR(E5=ngl,OR(E5=ngr,OR(E5=tng,E5=ng2l))),\"Rated fuel input\",\" \")))","v":" "},null,null,0,{"$f":"IF(B7=\" \",\" \",IF(B7=\"Rated mechanical output\",'Data Validation'!D21,IF(B7=\"Rated fuel input\",'Data Validation'!D22)))","v":" "}]
[null,"Choose one to calculate actual emissions",null,null,0,{"$f":"IF(B8='Data Validation'!D33,\" \",IF(B8='Data Validation'!D34,'Data Validation'!D29,IF(AND(B8='Data Validation'!D35,OR(E5=tng,OR(E5=ngl,OR(E5=ngr,OR(E5=ng2l))))),'Data Validation'!D30,IF(AND(B8='Data Validation'!D35,OR(E5=rd,OR(E5=rg))),'Data Validation'!D31,\" \"))))","v":" "}]
{"$rows_left_out":55}
{"sheet":"Natural gas (auxilary heat)","index":6,"n_rows":48,"n_cols":17,"rows_kept":48,"cut":false,"hidden":false,"merged":[[46,1,46,8],[47,1,47,5],[47,6,47,7],[1,1,1,10],[6,1,6,5],[5,1,5,8],[7,7,7,8],[7,1,7,3],[7,4,7,5],[2,1,3,8],[4,1,4,8],[13,10,14,10],[24,1,24,5],[29,1,29,5],[9,1,9,8],[45,1,45,8],[1,12,1,17],[2,12,3,13],[2,14,3,15],[2,16,3,17],[4,12,5,13],[4,14,5,15],[4,16,5,17],[6,12,7,13],[6,14,7,15],[6,16,7,17],[8,12,10,13],[8,14,10,15],[8,16,10,17]]}
[null,null,null,null,null,null,null,null,{"$f":"Instructions!$O$3","v":"p-sbap5-20  •  4/8/19"}]
[null,"Air emissions from natural gas combustion",null,null,null,null,null,null,null,null,null,null,"Tip: How to use this calculator"]
[null,"Natural gas combustion (less than 100 million Btu per hour)",null,null,null,null,null,null,null,null,null,null,"If you have…",null,"For potential emissions",null,"For actual emissions"]
[]
[null,"If you have a boiler with a rating of more than 100 million Btu per hour, different emission factors must be used (see EPA AP-42 Chapter 1.4).",null,null,null,null,null,null,null,null,null,null,"One process/heating unit",null,"Enter maximum rated heat input",null,"Enter amount of fuel burned or actual operation hours"]
[]
[null,"What is the total maximum rated heat input for the equipment?",null,null,null,null,0,"Btu per hour","(Check your units!)",null,null,null,"More than one process/heating unit",null,"Enter the total maximum rated heat input of all units, combined",null,"Enter amount of fuel burned. Do not use operation hours."]
[null,"In the previous 12 months, how many",null,null,"Choose one",null,0,{"$f":"IF(E8='Data Validation'!D40,\"\",IF(E8='Data Validation'!D41,\"hours/year\",IF(E8='Data Validation'!D42,\"cu ft/year\")))","v":""}]
{"$rows_left_out":41}
{"sheet":"Propane (auxilary heat)","index":7,"n_rows":49,"n_cols":17,"rows_kept":49,"cut":false,"hidden":false,"merged":[[48,1,48,5],[48,6,48,7],[7,1,7,8],[6,1,6,3],[6,4,6,5],[8,1,8,5],[8,7,8,8],[46,1,46,8],[47,1,47,8],[30,1,30,5],[10,1,10,8],[25,1,25,5],[1,12,1,17],[2,12,3,13],[2,14,3,15],[5,1,5,5],[2,1,3,8],[1,1,1,10],[2,16,3,17],[4,12,5,13],[4,14,5,15],[4,16,5,17],[14,10,15,10],[16,1,16,5],[6,12,7,13],[6,14,7,15],[6,16,7,17],[8,12,10,13],[8,14,10,15],[8,16,10,17]]}
[null,null,null,null,null,null,null,null,{"$f":"Instructions!$O$3","v":"p-sbap5-20  •  4/8/19"}]
[null,"Air emissions from burning propane",null,null,null,null,null,null,null,null,null,null,"Tip: How to use this calculator"]
[null,"Propane combustion",null,null,null,null,null,null,null,null,null,null,"If you have…",null,"For potential emissions",null,"For actual emissions"]
[]
[null,null,null,null,null,null,null,null,null,null,null,null,"One process/heating unit",null,"Enter maximum rated heat input",null,"Enter amount of fuel burned or actual operation hours"]
[null,"What is the maximum rated heat input?",null,null,null,null,0,"Btu per hour","(Check your units!)"]
[null,"In the previous 12 months, how many",null,null,"Choose one",null,0,{"$f":"IF(E7='Data Validation'!D46,\" \",IF(E7='Data Validation'!D47,\"hours/year\",IF(E7='Data Validation'!D48,\"gallons/year\")))","v":" "},null,null,null,null,"More than one process/heating unit",null,"Enter the total maximum rated heat input of all units, combined",null,"Enter amount of fuel burned. Do not use operation hours."]
[]
{"$rows_left_out":42}
{"sheet":"Fugitive","index":8,"n_rows":79,"n_cols":9,"rows_kept":79,"cut":false,"hidden":false,"merged":[[47,5,47,7],[64,1,65,1],[61,4,61,5],[61,6,61,7],[35,1,35,8],[42,1,42,8],[38,1,38,2],[38,4,38,8],[39,1,39,2],[39,4,39,7],[36,1,36,8],[41,1,41,2],[41,4,41,7],[40,1,40,2],[40,4,40,7],[37,1,37,2],[43,1,43,8],[47,1,47,2],[49,1,49,8],[51,1,53,1],[48,1,48,2],[48,4,48,7],[51,2,51,3],[46,1,46,2],[74,1,74,5],[74,7,80,8],[75,1,75,2],[75,3,75,6],[76,1,76,6],[77,1,77,2],[77,3,77,6],[78,1,78,6],[71,4,71,8],[72,5,72,8],[73,5,73,8],[1,1,1,8],[21,1,21,8],[22,1,22,8],[24,5,24,7],[3,1,3,8],[4,1,5,8],[7,2,7,3],[7,4,8,8],[18,2,18,3],[18,4,19,8],[17,1,17,8],[9,1,9,8],[10,1,10,8],[11,1,11,8],[12,2,12,3],[13,1,14,1],[13,2,14,3],[13,4,16,7],[15,1,16,1],[15,2,16,3],[46,4,46,7],[44,1,44,2],[45,1,45,2],[45,4,45,8],[44,4,44,8],[2,1,2,8],[26,5,26,7],[25,5,25,7],[26,1,26,2],[27,1,27,2],[28,4,28,7],[29,1,29,2],[29,4,29,7],[34,1,34,2],[24,1,24,2],[25,1,25,2],[28,1,28,2],[31,1,31,2],[34,6,34,7],[31,5,31,8],[32,4,32,7],[33,1,33,2],[33,4,33,7],[32,1,32,2],[30,1,30,2],[70,2,70,3],[70,6,70,7],[50,1,50,8],[51,8,55,8],[61,8,65,8],[62,2,62,3],[62,4,62,5],[62,6,62,7],[63,2,63,3],[59,1,59,8],[61,1,63,1],[61,2,61,3],[51,4,51,5],[51,6,51,7],[52,2,52,3],[52,4,52,5],[53,2,53,3],[53,4,53,5],[53,6,53,7],[52,6,52,7],[63,4,63,5],[63,6,63,7],[60,1,60,8]]}
[null,null,null,null,null,null,null,null,{"$f":"Instructions!$O$3","v":"p-sbap5-20  •  4/8/19"}]
[null,"Air emissions from fugitive sources"]
[null,"Fugitive emissions1"]
[null,"Potential emissions"]
[null,"Your potential emissions from fugitive sources must be used in identifying whether a permit is required. Fugitive sources include unpaved roads, material handling at stockpiles, and wind erosion of ground piles. "]
[]
[]
[null,null,"Throughput  (maximum capacity) ",null,"<-------- The maximum throughput used on the hot mix asphalt tab for potential emissions is automatically entered here."]
{"$rows_left_out":72}
{"sheet":"Potential emissions","index":9,"n_rows":105,"n_cols":11,"rows_kept":105,"cut":false,"hidden":false,"merged":[[1,1,1,10],[3,1,4,1],[2,1,2,10],[79,1,79,10],[99,3,99,4],[99,5,99,6],[103,2,103,3],[19,1,19,10],[14,1,14,10],[93,3,93,4],[93,5,93,6],[94,5,94,6],[100,5,100,6],[102,3,102,6],[98,3,98,6],[101,3,101,6]]}
[null,null,null,null,null,null,null,null,null,null,{"$f":"Instructions!$O$3","v":"p-sbap5-20  •  4/8/19"}]
[null,"Potential emissions: hot mix asphalt"]
[null,{"$f":"IF('Data Validation'!A36=\"yes\",\"The flag next to a potential emission total means your potential emissions exceed the permitting threshold and a permit is required.\",\"These pollutant totals represent the information you entered into this calculator.\")","v":"These pollutant totals represent the information you entered into this calculator."}]
[null,"Pollutant","Hot Mix Asphalt","Load Out","Silos","Generator","Natural Gas, other","Propane, other","Fugitive","Potential Emissions","Permitting Threshold"]
[null,null,"(ton/yr)","(ton/yr)","(ton/yr)","(ton/yr)","(ton/yr)","(ton/yr)","(ton/yr)","(ton/yr)","(ton/yr)"]
[null,"Criteria Air Pollutants",null,null,null,null,{"$f":"IF(AND('Natural gas (auxilary heat)'!J16=6,'Natural gas (auxilary heat)'!G7>0),\"Insignificant Activity\",\"\")","v":""},{"$f":"IF(AND('Propane (auxilary heat)'!J17=6,'Propane (auxilary heat)'!G6>0),\"Insignificant Activity\",\"\")","v":""}]
[null,"PM",{"$f":"'Hot mix asphalt'!H29","v":0},{"$f":"'Load out and silos'!G15","v":0},{"$f":"'Load out and silos'!O15","v":0},{"$f":"Generator!H20","v":0},{"$f":"'Natural gas (auxilary heat)'!H17","v":0},{"$f":"'Propane (auxilary heat)'!H18","v":0},{"$f":"Fugitive!I57","v":0},{"$f":"SUM(C7:I7)","v":0},100]
[null,"PM10",{"$f":"'Hot mix asphalt'!H30","v":0},{"$f":"'Load out and silos'!G16","v":0},{"$f":"'Load out and silos'!O16","v":0},{"$f":"Generator!H21","v":0},{"$f":"'Natural gas (auxilary heat)'!H18","v":0},{"$f":"'Propane (auxilary heat)'!H19","v":0},{"$f":"Fugitive!I58","v":0},{"$f":"SUM(C8:I8)","v":0},25]
{"$rows_left_out":98}
{"sheet":"Actual emissions","index":10,"n_rows":105,"n_cols":11,"rows_kept":105,"cut":false,"hidden":false,"merged":[[79,1,79,10],[91,1,91,10],[97,1,97,10],[103,2,103,3],[1,1,1,10],[3,1,4,1],[14,1,14,10],[19,1,19,10],[2,1,2,10]]}
[null,null,null,null,null,null,null,null,null,null,{"$f":"Instructions!$O$3","v":"p-sbap5-20  •  4/8/19"}]
[null,"Actual emissions: hot mix asphalt"]
[null,{"$f":"IF('Data Validation'!A39=\"yes\",\"The flag next to your actual emissions total indicates that your business exceeds the Option D limit and an individual permit is required.\",\"These pollutant totals represent the information you entered into this calculator.\")","v":"These pollutant totals represent the information you entered into this calculator."}]
[null,"Pollutant","Hot Mix Asphalt","Load Out","Silos","Generator","Natural Gas, other","Propane, other","Fugitive","Actual Emissions","Opt. D Permit Limits"]
[null,null,"(ton/yr)","(ton/yr)","(ton/yr)","(ton/yr)","(ton/yr)","(ton/yr)","(ton/yr)","(ton/yr)","(ton/yr)"]
[null,"Criteria Air Pollutants"]
[null,"PM",{"$f":"'Hot mix asphalt'!J29","v":0},{"$f":"'Load out and silos'!H15","v":0},{"$f":"'Load out and silos'!P15","v":0},{"$f":"Generator!I20","v":0},{"$f":"'Natural gas (auxilary heat)'!I17","v":0},{"$f":"'Propane (auxilary heat)'!I18","v":0},{"$f":"Fugitive!I67","v":0},{"$f":"SUM(C7:I7)","v":0},50]
[null,"PM10",{"$f":"'Hot mix asphalt'!J30","v":0},{"$f":"'Load out and silos'!H16","v":0},{"$f":"'Load out and silos'!P16","v":0},{"$f":"Generator!I21","v":0},{"$f":"'Natural gas (auxilary heat)'!I18","v":0},{"$f":"'Propane (auxilary heat)'!I19","v":0},{"$f":"Fugitive!I68","v":0},{"$f":"SUM(C8:I8)","v":0},50]
{"$rows_left_out":98}
{"sheet":"Permits & requirements","index":11,"n_rows":51,"n_cols":9,"rows_kept":51,"cut":false,"hidden":false,"merged":[[39,1,39,2],[39,3,39,4],[37,1,37,8],[45,1,45,8],[17,1,19,1],[17,2,19,2],[17,4,19,4],[24,8,25,8],[25,5,25,6],[17,5,19,6],[24,7,25,7],[17,3,19,3],[40,1,40,5],[41,1,41,5],[42,1,42,4],[43,1,43,4],[50,1,50,2],[50,3,50,5],[46,1,46,5],[47,1,47,5],[48,1,48,5],[49,1,49,5],[1,1,1,8],[8,1,8,4],[8,5,16,8],[9,1,9,4],[10,1,11,1],[5,1,6,8],[12,4,14,4],[2,1,4,8],[7,1,7,8],[10,2,11,2],[10,3,11,3],[10,4,11,4],[12,1,14,1],[12,2,14,2],[12,3,14,3],[32,2,33,8],[34,1,36,8],[29,1,29,2],[29,3,29,4],[30,2,30,8],[31,2,31,8],[26,1,27,6],[26,7,27,8],[17,7,19,7],[15,1,16,1],[15,2,16,2],[15,3,16,3],[15,4,16,4],[17,8,19,8],[20,4,25,4],[20,5,20,6],[21,5,21,6],[21,7,23,7],[21,8,23,8],[22,5,22,6],[23,5,23,6],[24,5,24,6]]}
[null,null,null,null,null,null,null,null,{"$f":"Instructions!$O$3","v":"p-sbap5-20  •  4/8/19"}]
[null,"Permits & Requirements"]
[null,"The need for a permit is based on your entire business' potential air emissions. All activities that put pollutants into the air (such as paint and solvent use that are not associated with maintenance) need to be assessed if they are not included in this calculator. Once you identify if you need a permit, based on whether an NSPS applies and potential emissions, you can then use your actual emissions to see which permit is the best fit for your business."]
[]
[]
[null,"Content below is based on the information entered into this calculator and is not an official MPCA permit determination."]
[]
[]
{"$rows_left_out":44}
{"sheet":"Hot mix emission factors","index":12,"n_rows":92,"n_cols":13,"rows_kept":92,"cut":false,"hidden":false,"merged":[[91,3,93,6],[1,1,1,3],[82,3,83,6],[2,12,6,12],[2,9,6,9],[2,10,6,10],[1,9,1,10],[1,11,1,12],[1,4,1,6],[2,11,6,11],[9,9,9,10],[9,11,9,12],[61,8,62,12],[84,3,85,6],[86,3,87,6],[88,3,90,6]]}
["Emission factors for hot mix asphalt",null,null,null,null,null,{"$f":"Instructions!$O$3","v":"p-sbap5-20  •  4/8/19"},null,null,null,null,null,"p-sbap5-20"]
[null,"Batch plant with rotary dryer",null,null,"Drum mix plant",null,null,null,null,"Load out ",null,"Silo Filling"]
[null,"Natural Gas","Diesel No. 2 Fuel Oil","Waste/drain Oil","Natural Gas","Diesel No. 2 Fuel Oil","Waste/drain Oil",null,null,"No site specific information","Equation with site specific information.","No site specific information","Equation with site specific information."]
[null,"Methane","No. 1 Fuel Oil","No. 6 Fuel Oil","Methane","No. 1 Fuel Oil","No. 6 Fuel Oil"]
[null,"Butane","Gasoline","No. 3 Fuel Oil","Butane","Gasoline","No. 3 Fuel Oil"]
[null,"Propane","Kerosene","No. 4 Fuel Oil","Propane","Kerosene","No. 4 Fuel Oil"]
[null,null,"Jet fuel","No. 5 Fuel Oil",null,"Jet fuel","No. 5 Fuel Oil"]
["Units","lb/ton","lb/ton","lb/ton","lb/ton","lb/ton","lb/ton",null,null,"lb/ton","lb/ton","lb/ton","lb/ton"]
{"$rows_left_out":85}
{"sheet":"Engine Emission Factors","index":13,"n_rows":53,"n_cols":8,"rows_kept":53,"cut":false,"hidden":false,"merged":[[51,1,51,4],[0,0,0,6]]}
["Engine emission factors",null,null,null,null,null,null,{"$f":"Instructions!$O$3","v":"p-sbap5-20  •  4/8/19"}]
[null,"RECIPROCATING ENGINES (<600HP) DIESEL (lb/MMBtu)","RECIPROCATING ENGINES (>=600HP) DIESEL (lb/MMBtu)1","TURBINE ENGINES (electrical generation) NATURAL GAS (lb/MMBtu)1","RECIPROCATING GASOLINE (lb/MMBtu)2","RECIPROCATING Natural Gas 4-Stroke  Rich-Burn (lb/MMBtu)","RECIPROCATING Natural Gas 4-Stroke Lean-Burn (lb/MMBtu)","RECIPROCATING Natural Gas 2-Stroke Lean-Burn (lb/MMBtu)"]
["source","AP42 Chpt 3.3 (10/96)","AP42 Chpt 3.4 (10/96)","AP42 Chpt 3.1 (4/00)","AP42 Chpt 3.3 (10/96)","AP42 Chpt 3.2-3 (7/00)","AP42 Chpt 3.2-2 (7/00)","AP42 Chpt 3.2-2 (7/00)"]
["PM",0.31,0.1,6.6E-3,0.1,{"$f":"0.0095+0.00991","v":1.941E-2},{"$f":"0.0000771+0.00991","v":9.9871000000000005E-3},{"$f":"0.0384+0.00991","v":4.8309999999999999E-2}]
["PM10",0.31,{"$f":"0.0496+0.0077","v":5.7299999999999997E-2},{"$f":"0.0019+0.0047","v":6.6E-3},0.1,{"$f":"0.0095+0.00991","v":1.941E-2},{"$f":"G4","v":9.9871000000000005E-3},{"$f":"H4","v":4.8309999999999999E-2}]
["PM2.5",0.31,{"$f":"0.0479+0.0077","v":5.5599999999999997E-2},{"$f":"D5","v":6.6E-3},0.1,{"$f":"F5","v":1.941E-2},{"$f":"G4","v":9.9871000000000005E-3},{"$f":"H5","v":4.8309999999999999E-2}]
["SOx",0.28999999999999998,1.01,0.94,8.4000000000000005E-2,5.8799999999999998E-4,5.8799999999999998E-4,5.8799999999999998E-4]
["NOx",4.41,3.2,0.32,1.63,2.21,4.08,3.17]
{"$rows_left_out":46}
{"sheet":"Data Validation","index":14,"n_rows":48,"n_cols":4,"rows_kept":48,"cut":false,"hidden":true,"merged":[[0,0,0,3],[1,0,1,3],[3,1,3,2]]}
["p-sbap5-20"]
["Data Validation - Hot Mix Asphalt"]
[]
["General","Hot Mix Asphalt",null,"Generator"]
["Options","Plant type",null,"Engine and fuel type"]
["Choose one","Choose one",null,"Choose one"]
["Yes","Batch plant with rotary dryer",null,"Reciprocating - diesel"]
["No","Drum mix plant",null,"Reciprocating - gasoline"]
{"$rows_left_out":40}