{"text_format":"1","workbook":"xlsx","n_sheets":12,"sheets":["Instructions","Federal Standards","Engine 1","Engine 2","Engine 3","Engine 4","Engine 5","Potential Emissions","Actual Emissions","Permits & Requirements","Engine Emission Factors","Data Validation"],"not_rendered":{"charts":0,"images":1,"macros":1,"external_links":0,"defined_names":33,"comments":1,"pivot_tables":0},"unopened":[],"bounds":{"document_bytes":16777216,"sheet_cells":100000,"rows_first":2000,"rows_last":500,"rows_between":2000,"halvings":0,"cell_chars":16384,"cell_head_chars":4096},"cells_cut":0,"cells_raw":0,"read":"whole","date_system":"1900"}

{"sheet":"Instructions","index":0,"n_rows":31,"n_cols":15,"rows_kept":31,"cut":false,"hidden":false,"merged":[[30,1,30,4],[30,5,30,14],[19,2,19,14],[22,1,22,14],[14,2,14,14],[15,2,15,14],[16,2,16,14],[17,2,17,14],[23,1,23,14],[24,1,24,14],[25,2,25,3],[25,5,25,8],[25,10,25,14],[26,2,26,3],[26,4,26,14],[28,4,28,13],[18,2,18,14],[5,1,5,14],[13,1,13,14],[0,1,4,5],[6,1,6,14],[8,1,8,14],[9,1,9,14],[10,1,10,14],[7,1,7,14],[0,6,1,14]]}
[null,null,null,null,null,null,"Internal combustion engines\nair emissions calculator   "]
[]
[]
[null,null,null,null,null,null,null,null,null,null,null,null,null,null,"p-sbap5-25  •  9/3/19"]
[]
[null,"Instructions"]
[null,"1) Start with the Federal Standards tab to identify if a federal rule applies to your engine."]
[null,"2) Use the blue tabs across the bottom to enter information for your engines. Use only one blue tab per engine."]
[null,"3) The green tabs total potential and actual emissions from the information entered on the blue tabs."]
[null,"4) The yellow 'Permits & Requirements' tab will help you decide which permit to apply for. "]
{"$rows_left_out":22}
{"sheet":"Federal Standards","index":1,"n_rows":54,"n_cols":14,"rows_kept":54,"cut":false,"hidden":false,"merged":[[54,1,54,14],[45,1,45,14],[13,1,13,14],[22,1,22,14],[23,1,23,12],[24,1,24,12],[25,9,25,12],[27,2,27,12],[28,2,28,12],[23,13,23,14],[14,1,14,12],[15,1,15,12],[16,2,16,7],[17,2,17,8],[17,9,17,12],[16,9,16,12],[11,1,11,14],[14,13,14,14],[53,13,53,14],[49,2,50,14],[51,2,51,14],[52,1,52,14],[53,1,53,7],[53,8,53,9],[53,10,53,12],[49,1,50,1],[12,1,12,14],[46,1,47,14],[48,2,48,14],[18,1,18,12],[19,2,19,12],[21,1,21,12],[44,1,44,14],[0,1,0,14],[25,2,25,7],[20,2,20,12],[26,1,26,12],[31,1,31,12],[24,13,27,14],[2,1,2,14],[1,1,1,14],[3,8,5,14],[6,2,6,13],[6,14,10,14],[7,1,8,1],[7,2,8,13],[9,1,10,1],[9,2,10,13],[3,1,5,6],[40,9,42,14],[37,9,38,14],[32,1,32,14],[40,2,41,7],[42,2,42,7],[33,1,36,7],[37,2,38,7],[33,8,35,14],[30,1,30,7],[30,8,30,12],[28,13,29,14],[15,13,18,14],[19,13,20,14],[39,2,39,7],[39,9,39,14]]}
[null,{"$f":"Instructions!O4","v":"p-sbap5-25  •  9/3/19"}]
[null,"U.S. EPA standards for reciprocating internal combustion engines (RICE)"]
[null,"Applicability is determined separately for each engine. Each of your engines and any other air pollutant sources will need to be evaluated."]
[null,"New source performance standards (NSPS) require new emission sources to be less polluting than older sources.",null,null,null,null,null,null,"National emission standards for hazardous air pollutants (NESHAP) prevent or reduce emissions that have health impacts."]
[]
[]
[null,"▪ ","Each NSPS or NESHAP describes specific equipment, processes, or industries. "]
[null,"▪ ","Multiple federal standards may apply to your business. It is possible that if you make a change at your business, a federal standard that did not previously apply now will, or the one you are already following may have additional requirements."]
[]
[null,"▪ ","Federal standards can determine whether you need a permit and what requirements you must follow. You may have to follow federal standard requirements in addition to state permit requirements. Below are some of the common federal standards that affect engines."]
{"$rows_left_out":45}
{"sheet":"Engine 1","index":2,"n_rows":62,"n_cols":11,"rows_kept":62,"cut":false,"hidden":false,"merged":[[0,1,0,10],[1,1,1,10],[61,5,61,6],[4,1,4,3],[5,1,5,3],[6,1,6,3],[10,1,10,3],[7,1,7,3],[4,4,4,5],[2,1,2,8],[61,1,61,4],[14,3,15,3],[14,4,15,4],[16,10,17,10],[10,5,10,8],[6,5,6,8],[14,10,15,10],[14,7,15,7],[14,8,15,8],[14,1,15,1],[14,2,15,2],[14,5,15,5],[14,6,15,6],[4,6,4,7],[9,1,9,3],[9,5,9,8],[5,5,5,8],[59,5,60,8],[8,1,8,3],[8,5,8,8],[32,6,32,8],[59,1,59,4],[60,1,60,4],[11,1,11,8],[12,1,12,8],[7,5,7,8]]}
[null,{"$f":"Instructions!O4","v":"p-sbap5-25  •  9/3/19"}]
[null,"Air emissions from internal combustion engines"]
[null,"Reciprocating internal combustion engine (RICE)"]
[]
[null,"Engine and fuel type",null,null,"Choose one",null,"Facility identifier for engine",null,"Engine 1"]
[null,"Engine use",null,null,"Choose one","If emergency engine is used for peak-shaving or contracted for >15 hr/yr, choose 'Routine.'"]
[null,{"$f":"IF(E5='Data Validation'!A6,\" \",IF(OR(E5=rd,E5=rg),\"Rated mechanical output\",IF(OR(E5=ngl,OR(E5=ngr,OR(E5=tng,E5=ng2l))),\"Rated fuel input\",\" \")))","v":" "},null,null,0,{"$f":"IF(B7=\" \",\" \",IF(B7=\"Rated mechanical output\",'Data Validation'!A23,IF(B7=\"Rated fuel input\",'Data Validation'!A24)))","v":" "}]
[null,"Choose one to calculate actual emissions",null,null,0,{"$f":"IF(B8='Data Validation'!B32,\" \",IF(B8='Data Validation'!B33,'Data Validation'!B38,IF(AND(B8='Data Validation'!B34,OR(E5=tng,OR(E5=ngl,OR(E5=ngr,OR(E5=ng2l))))),'Data Validation'!B39,IF(AND(B8='Data Validation'!B34,OR(E5=rd,OR(E5=rg))),'Data Validation'!B40,\" \"))))","v":" "}]
[null,{"$f":"IF(F7=\" \",\" \",IF(F7='Data Validation'!A23,'Data Validation'!A28,IF(F7='Data Validation'!A24,'Data Validation'!A29)))","v":" "},null,null,{"$f":"IF(E5='Data Validation'!A6,\" \",IF(E5=rd,'Engine Emission Factors'!F48,IF(E5=rg,'Engine Emission Factors'!F49,IF(OR(E5=ngl,OR(E5=ngr,OR(E5=tng,E5=ng2l))),'Engine Emission Factors'!G47,\" \"))))","v":" "},{"$f":"IF(B9=\" \",\" \",IF(B9='Data Validation'!A28,\"(Btu/HP-hr)\",IF(B9='Data Validation'!A29,\"Btu/scf\")))","v":" "}]
[null,{"$f":"IF(E5='Data Validation'!A6,\" \",IF(E5=rd,\"Heat value of fuel\",IF(E5=rg,\"Heat value of fuel\",\" \")))","v":" "},null,"Heat value of fuel",{"$f":"IF(E5=rd,'Engine Emission Factors'!H48,IF(E5=rg,'Engine Emission Factors'!H49,\" \"))","v":" "},{"$f":"IF(E5='Data Validation'!A6,\" \",IF(E5=rd,\"(Btu/gal)\",IF(E5=rg,\"(Btu/gal)\",\" \")))","v":" "}]
{"$rows_left_out":53}
{"sheet":"Engine 2","index":3,"n_rows":62,"n_cols":11,"rows_kept":62,"cut":false,"hidden":false,"merged":[[8,1,8,3],[8,5,8,8],[0,1,0,10],[1,1,1,10],[2,1,2,8],[4,1,4,3],[4,4,4,5],[4,6,4,7],[14,10,15,10],[16,10,17,10],[32,6,32,8],[59,1,59,4],[59,5,60,8],[60,1,60,4],[14,1,15,1],[14,2,15,2],[14,3,15,3],[14,4,15,4],[14,5,15,5],[14,6,15,6],[61,1,61,4],[61,5,61,6],[5,5,5,8],[14,7,15,7],[14,8,15,8],[9,1,9,3],[9,5,9,8],[10,1,10,3],[10,5,10,8],[11,1,11,8],[12,1,12,8],[5,1,5,3],[6,1,6,3],[6,5,6,8],[7,1,7,3],[7,5,7,8]]}
[null,{"$f":"Instructions!O4","v":"p-sbap5-25  •  9/3/19"}]
[null,"Air emissions from internal combustion engines"]
[null,"Reciprocating internal combustion engine (RICE)"]
[]
[null,"Engine and fuel type",null,null,"Choose one",null,"Facility identifier for engine",null,"Engine 2"]
[null,"Engine use",null,null,"Choose one","If emergency engine is used for peak-shaving or contracted for >15 hr/yr, choose 'Routine.'"]
[null,{"$f":"IF(E5='Data Validation'!A6,\" \",IF(OR(E5=rd,E5=rg),\"Rated mechanical output\",IF(OR(E5=ngl,OR(E5=ngr,OR(E5=tng,E5=ng2l))),\"Rated fuel input\",\" \")))","v":" "},null,null,0,{"$f":"IF(B7=\" \",\" \",IF(B7=\"Rated mechanical output\",'Data Validation'!A23,IF(B7=\"Rated fuel input\",'Data Validation'!A24)))","v":" "}]
[null,"Choose one to calculate actual emissions",null,null,0,{"$f":"IF(B8='Data Validation'!B32,\" \",IF(B8='Data Validation'!B33,'Data Validation'!B38,IF(AND(B8='Data Validation'!B34,OR(E5=tng,OR(E5=ngl,OR(E5=ngr,OR(E5=ng2l))))),'Data Validation'!B39,IF(AND(B8='Data Validation'!B34,OR(E5=rd,OR(E5=rg))),'Data Validation'!B40,\" \"))))","v":" "}]
[null,{"$f":"IF(F7=\" \",\" \",IF(F7='Data Validation'!A23,'Data Validation'!A28,IF(F7='Data Validation'!A24,'Data Validation'!A29)))","v":" "},null,null,{"$f":"IF(E5='Data Validation'!A6,\" \",IF(E5=rd,'Engine Emission Factors'!F48,IF(E5=rg,'Engine Emission Factors'!F49,IF(OR(E5=ngl,OR(E5=ngr,OR(E5=tng,E5=ng2l))),'Engine Emission Factors'!G47,\" \"))))","v":" "},{"$f":"IF(B9=\" \",\" \",IF(B9='Data Validation'!A28,\"(Btu/HP-hr)\",IF(B9='Data Validation'!A29,\"Btu/scf\")))","v":" "}]
[null,{"$f":"IF(E5='Data Validation'!A6,\" \",IF(E5=rd,\"Heat value of fuel\",IF(E5=rg,\"Heat value of fuel\",\" \")))","v":" "},null,"Heat value of fuel",{"$f":"IF(E5=rd,'Engine Emission Factors'!H48,IF(E5=rg,'Engine Emission Factors'!H49,\" \"))","v":" "},{"$f":"IF(E5='Data Validation'!A6,\" \",IF(E5=rd,\"(Btu/gal)\",IF(E5=rg,\"(Btu/gal)\",\" \")))","v":" "}]
{"$rows_left_out":53}
{"sheet":"Engine 3","index":4,"n_rows":62,"n_cols":11,"rows_kept":62,"cut":false,"hidden":false,"merged":[[8,1,8,3],[8,5,8,8],[0,1,0,10],[1,1,1,10],[2,1,2,8],[4,1,4,3],[4,4,4,5],[4,6,4,7],[14,10,15,10],[16,10,17,10],[32,6,32,8],[59,1,59,4],[59,5,60,8],[60,1,60,4],[14,1,15,1],[14,2,15,2],[14,3,15,3],[14,4,15,4],[14,5,15,5],[14,6,15,6],[61,1,61,4],[61,5,61,6],[5,5,5,8],[14,7,15,7],[14,8,15,8],[9,1,9,3],[9,5,9,8],[10,1,10,3],[10,5,10,8],[11,1,11,8],[12,1,12,8],[5,1,5,3],[6,1,6,3],[6,5,6,8],[7,1,7,3],[7,5,7,8]]}
[null,{"$f":"Instructions!O4","v":"p-sbap5-25  •  9/3/19"}]
[null,"Air emissions from internal combustion engines"]
[null,"Reciprocating internal combustion engine (RICE)"]
[]
[null,"Engine and fuel type",null,null,"Choose one",null,"Facility identifier for engine",null,"Engine 3"]
[null,"Engine use",null,null,"Choose one","If emergency engine is used for peak-shaving or contracted for >15 hr/yr, choose 'Routine.'"]
[null,{"$f":"IF(E5='Data Validation'!A6,\" \",IF(OR(E5=rd,E5=rg),\"Rated mechanical output\",IF(OR(E5=ngl,OR(E5=ngr,OR(E5=tng,E5=ng2l))),\"Rated fuel input\",\" \")))","v":" "},null,null,0,{"$f":"IF(B7=\" \",\" \",IF(B7=\"Rated mechanical output\",'Data Validation'!A23,IF(B7=\"Rated fuel input\",'Data Validation'!A24)))","v":" "}]
[null,"Choose one to calculate actual emissions",null,null,0,{"$f":"IF(B8='Data Validation'!B32,\" \",IF(B8='Data Validation'!B33,'Data Validation'!B38,IF(AND(B8='Data Validation'!B34,OR(E5=tng,OR(E5=ngl,OR(E5=ngr,OR(E5=ng2l))))),'Data Validation'!B39,IF(AND(B8='Data Validation'!B34,OR(E5=rd,OR(E5=rg))),'Data Validation'!B40,\" \"))))","v":" "}]
[null,{"$f":"IF(F7=\" \",\" \",IF(F7='Data Validation'!A23,'Data Validation'!A28,IF(F7='Data Validation'!A24,'Data Validation'!A29)))","v":" "},null,null,{"$f":"IF(E5='Data Validation'!A6,\" \",IF(E5=rd,'Engine Emission Factors'!F48,IF(E5=rg,'Engine Emission Factors'!F49,IF(OR(E5=ngl,OR(E5=ngr,OR(E5=tng,E5=ng2l))),'Engine Emission Factors'!G47,\" \"))))","v":" "},{"$f":"IF(B9=\" \",\" \",IF(B9='Data Validation'!A28,\"(Btu/HP-hr)\",IF(B9='Data Validation'!A29,\"Btu/scf\")))","v":" "}]
[null,{"$f":"IF(E5='Data Validation'!A6,\" \",IF(E5=rd,\"Heat value of fuel\",IF(E5=rg,\"Heat value of fuel\",\" \")))","v":" "},null,"Heat value of fuel",{"$f":"IF(E5=rd,'Engine Emission Factors'!H48,IF(E5=rg,'Engine Emission Factors'!H49,\" \"))","v":" "},{"$f":"IF(E5='Data Validation'!A6,\" \",IF(E5=rd,\"(Btu/gal)\",IF(E5=rg,\"(Btu/gal)\",\" \")))","v":" "}]
{"$rows_left_out":53}
{"sheet":"Engine 4","index":5,"n_rows":62,"n_cols":11,"rows_kept":62,"cut":false,"hidden":false,"merged":[[8,1,8,3],[8,5,8,8],[0,1,0,10],[1,1,1,10],[2,1,2,8],[4,1,4,3],[4,4,4,5],[4,6,4,7],[14,10,15,10],[16,10,17,10],[32,6,32,8],[59,1,59,4],[59,5,60,8],[60,1,60,4],[14,1,15,1],[14,2,15,2],[14,3,15,3],[14,4,15,4],[14,5,15,5],[14,6,15,6],[61,1,61,4],[61,5,61,6],[5,5,5,8],[14,7,15,7],[14,8,15,8],[9,1,9,3],[9,5,9,8],[10,1,10,3],[10,5,10,8],[11,1,11,8],[12,1,12,8],[5,1,5,3],[6,1,6,3],[6,5,6,8],[7,1,7,3],[7,5,7,8]]}
[null,{"$f":"Instructions!O4","v":"p-sbap5-25  •  9/3/19"}]
[null,"Air emissions from internal combustion engines"]
[null,"Reciprocating internal combustion engine (RICE)"]
[]
[null,"Engine and fuel type",null,null,"Choose one",null,"Facility identifier for engine",null,"Engine 4"]
[null,"Engine use",null,null,"Choose one","If emergency engine is used for peak-shaving or contracted for >15 hr/yr, choose 'Routine.'"]
[null,{"$f":"IF(E5='Data Validation'!A6,\" \",IF(OR(E5=rd,E5=rg),\"Rated mechanical output\",IF(OR(E5=ngl,OR(E5=ngr,OR(E5=tng,E5=ng2l))),\"Rated fuel input\",\" \")))","v":" "},null,null,0,{"$f":"IF(B7=\" \",\" \",IF(B7=\"Rated mechanical output\",'Data Validation'!A23,IF(B7=\"Rated fuel input\",'Data Validation'!A24)))","v":" "}]
[null,"Choose one to calculate actual emissions",null,null,0,{"$f":"IF(B8='Data Validation'!B32,\" \",IF(B8='Data Validation'!B33,'Data Validation'!B38,IF(AND(B8='Data Validation'!B34,OR(E5=tng,OR(E5=ngl,OR(E5=ngr,OR(E5=ng2l))))),'Data Validation'!B39,IF(AND(B8='Data Validation'!B34,OR(E5=rd,OR(E5=rg))),'Data Validation'!B40,\" \"))))","v":" "}]
[null,{"$f":"IF(F7=\" \",\" \",IF(F7='Data Validation'!A23,'Data Validation'!A28,IF(F7='Data Validation'!A24,'Data Validation'!A29)))","v":" "},null,null,{"$f":"IF(E5='Data Validation'!A6,\" \",IF(E5=rd,'Engine Emission Factors'!F48,IF(E5=rg,'Engine Emission Factors'!F49,IF(OR(E5=ngl,OR(E5=ngr,OR(E5=tng,E5=ng2l))),'Engine Emission Factors'!G47,\" \"))))","v":" "},{"$f":"IF(B9=\" \",\" \",IF(B9='Data Validation'!A28,\"(Btu/HP-hr)\",IF(B9='Data Validation'!A29,\"Btu/scf\")))","v":" "}]
[null,{"$f":"IF(E5='Data Validation'!A6,\" \",IF(E5=rd,\"Heat value of fuel\",IF(E5=rg,\"Heat value of fuel\",\" \")))","v":" "},null,"Heat value of fuel",{"$f":"IF(E5=rd,'Engine Emission Factors'!H48,IF(E5=rg,'Engine Emission Factors'!H49,\" \"))","v":" "},{"$f":"IF(E5='Data Validation'!A6,\" \",IF(E5=rd,\"(Btu/gal)\",IF(E5=rg,\"(Btu/gal)\",\" \")))","v":" "}]
{"$rows_left_out":53}
{"sheet":"Engine 5","index":6,"n_rows":62,"n_cols":11,"rows_kept":62,"cut":false,"hidden":false,"merged":[[8,1,8,3],[8,5,8,8],[0,1,0,10],[1,1,1,10],[2,1,2,8],[4,1,4,3],[4,4,4,5],[4,6,4,7],[14,10,15,10],[16,10,17,10],[32,6,32,8],[59,1,59,4],[59,5,60,8],[60,1,60,4],[14,1,15,1],[14,2,15,2],[14,3,15,3],[14,4,15,4],[14,5,15,5],[14,6,15,6],[61,1,61,4],[61,5,61,6],[5,5,5,8],[14,7,15,7],[14,8,15,8],[9,1,9,3],[9,5,9,8],[10,1,10,3],[10,5,10,8],[11,1,11,8],[12,1,12,8],[5,1,5,3],[6,1,6,3],[6,5,6,8],[7,1,7,3],[7,5,7,8]]}
[null,{"$f":"Instructions!O4","v":"p-sbap5-25  •  9/3/19"}]
[null,"Air emissions from internal combustion engines"]
[null,"Reciprocating internal combustion engine (RICE)"]
[]
[null,"Engine and fuel type",null,null,"Choose one",null,"Facility identifier for engine",null,"Engine 5"]
[null,"Engine use",null,null,"Choose one","If emergency engine is used for peak-shaving or contracted for >15 hr/yr, choose 'Routine.'"]
[null,{"$f":"IF(E5='Data Validation'!A6,\" \",IF(OR(E5=rd,E5=rg),\"Rated mechanical output\",IF(OR(E5=ngl,OR(E5=ngr,OR(E5=tng,E5=ng2l))),\"Rated fuel input\",\" \")))","v":" "},null,null,0,{"$f":"IF(B7=\" \",\" \",IF(B7=\"Rated mechanical output\",'Data Validation'!A23,IF(B7=\"Rated fuel input\",'Data Validation'!A24)))","v":" "}]
[null,"Choose one to calculate actual emissions",null,null,0,{"$f":"IF(B8='Data Validation'!B32,\" \",IF(B8='Data Validation'!B33,'Data Validation'!B38,IF(AND(B8='Data Validation'!B34,OR(E5=tng,OR(E5=ngl,OR(E5=ngr,OR(E5=ng2l))))),'Data Validation'!B39,IF(AND(B8='Data Validation'!B34,OR(E5=rd,OR(E5=rg))),'Data Validation'!B40,\" \"))))","v":" "}]
[null,{"$f":"IF(F7=\" \",\" \",IF(F7='Data Validation'!A23,'Data Validation'!A28,IF(F7='Data Validation'!A24,'Data Validation'!A29)))","v":" "},null,null,{"$f":"IF(E5='Data Validation'!A6,\" \",IF(E5=rd,'Engine Emission Factors'!F48,IF(E5=rg,'Engine Emission Factors'!F49,IF(OR(E5=ngl,OR(E5=ngr,OR(E5=tng,E5=ng2l))),'Engine Emission Factors'!G47,\" \"))))","v":" "},{"$f":"IF(B9=\" \",\" \",IF(B9='Data Validation'!A28,\"(Btu/HP-hr)\",IF(B9='Data Validation'!A29,\"Btu/scf\")))","v":" "}]
[null,{"$f":"IF(E5='Data Validation'!A6,\" \",IF(E5=rd,\"Heat value of fuel\",IF(E5=rg,\"Heat value of fuel\",\" \")))","v":" "},null,"Heat value of fuel",{"$f":"IF(E5=rd,'Engine Emission Factors'!H48,IF(E5=rg,'Engine Emission Factors'!H49,\" \"))","v":" "},{"$f":"IF(E5='Data Validation'!A6,\" \",IF(E5=rd,\"(Btu/gal)\",IF(E5=rg,\"(Btu/gal)\",\" \")))","v":" "}]
{"$rows_left_out":53}
{"sheet":"Potential Emissions","index":7,"n_rows":47,"n_cols":9,"rows_kept":47,"cut":false,"hidden":false,"merged":[[1,1,1,8],[3,1,4,1],[2,1,2,8],[0,1,0,8]]}
[null,{"$f":"Instructions!O4","v":"p-sbap5-25  •  9/3/19"}]
[null,"Potential emissions: Engines"]
[null,{"$f":"IF('Data Validation'!B27=\"yes\",\"The flag next to a potential emission total means your potential emissions exceed the permitting threshold and a permit is required.\",\"These pollutant totals represent the information you entered on the blue tabs.\")","v":"These pollutant totals represent the information you entered on the blue tabs."}]
[null,"Pollutant",{"$f":"'Engine 1'!$I$5","v":"Engine 1"},{"$f":"'Engine 2'!$I$5","v":"Engine 2"},{"$f":"'Engine 3'!$I$5","v":"Engine 3"},{"$f":"'Engine 4'!$I$5","v":"Engine 4"},{"$f":"'Engine 5'!$I$5","v":"Engine 5"},"Potential Emissions","Permitting Threshold"]
[null,null,"(ton/yr)","(ton/yr)","(ton/yr)","(ton/yr)","(ton/yr)","(ton/yr)","(ton/yr)"]
[null,"Criteria Air Pollutants",{"$f":"IF('Engine 1'!$J$19=6,\"Insignificant\",\"\")","v":"Insignificant"},{"$f":"IF('Engine 2'!$J$19=6,\"Insignificant\",\"\")","v":"Insignificant"},{"$f":"IF('Engine 3'!$J$19=6,\"Insignificant\",\"\")","v":"Insignificant"},{"$f":"IF('Engine 4'!$J$19=6,\"Insignificant\",\"\")","v":"Insignificant"},{"$f":"IF('Engine 5'!$J$19=6,\"Insignificant\",\"\")","v":"Insignificant"}]
[null,"PM",{"$f":"'Engine 1'!$H20","v":0},{"$f":"'Engine 2'!$H20","v":0},{"$f":"'Engine 3'!$H20","v":0},{"$f":"'Engine 4'!$H20","v":0},{"$f":"'Engine 5'!$H20","v":0},{"$f":"SUM(C7:G7)","v":0},100]
[null,"PM10",{"$f":"'Engine 1'!$H21","v":0},{"$f":"'Engine 2'!$H21","v":0},{"$f":"'Engine 3'!$H21","v":0},{"$f":"'Engine 4'!$H21","v":0},{"$f":"'Engine 5'!$H21","v":0},{"$f":"SUM(C8:G8)","v":0},25]
[null,"PM2.5",{"$f":"'Engine 1'!$H22","v":0},{"$f":"'Engine 2'!$H22","v":0},{"$f":"'Engine 3'!$H22","v":0},{"$f":"'Engine 4'!$H22","v":0},{"$f":"'Engine 5'!$H22","v":0},0,100]
[null,"SOx",{"$f":"'Engine 1'!$H23","v":0},{"$f":"'Engine 2'!$H23","v":0},{"$f":"'Engine 3'!$H23","v":0},{"$f":"'Engine 4'!$H23","v":0},{"$f":"'Engine 5'!$H23","v":0},0,50]
{"$rows_left_out":38}
{"sheet":"Actual Emissions","index":8,"n_rows":47,"n_cols":9,"rows_kept":47,"cut":false,"hidden":false,"merged":[[1,1,1,8],[3,1,4,1],[0,1,0,8],[2,1,2,8]]}
[null,{"$f":"Instructions!O4","v":"p-sbap5-25  •  9/3/19"}]
[null,"Actual emissions: Engines"]
[null,{"$f":"IF('Data Validation'!B30=\"yes\",\"The flag next to your actual emissions total indicates that your business exceeds the Option D limit and an individual permit is required.\",\"These pollutant totals represent the information you entered on the blue tabs.\")","v":"These pollutant totals represent the information you entered on the blue tabs."}]
[null,"Pollutant","Engine 1","Engine 2","Engine 3","Engine 4","Engine 5","Actual Emissions","Opt. D Permit Limits"]
[null,null,"(ton/yr)","(ton/yr)","(ton/yr)","(ton/yr)","(ton/yr)","(ton/yr)","(ton/yr)"]
[null,"Criteria Air Pollutants"]
[null,"PM",{"$f":"'Engine 1'!$I20","v":0},{"$f":"'Engine 2'!$I20","v":0},{"$f":"'Engine 3'!$I20","v":0},{"$f":"'Engine 4'!$I20","v":0},{"$f":"'Engine 5'!$I20","v":0},{"$f":"SUM(C7:G7)","v":0},50]
[null,"PM10",{"$f":"'Engine 1'!$I21","v":0},{"$f":"'Engine 2'!$I21","v":0},{"$f":"'Engine 3'!$I21","v":0},{"$f":"'Engine 4'!$I21","v":0},{"$f":"'Engine 5'!$I21","v":0},{"$f":"SUM(C8:G8)","v":0},50]
[null,"PM2.5",{"$f":"'Engine 1'!$I22","v":0},{"$f":"'Engine 2'!$I22","v":0},{"$f":"'Engine 3'!$I22","v":0},{"$f":"'Engine 4'!$I22","v":0},{"$f":"'Engine 5'!$I22","v":0},0,50]
[null,"SOx",{"$f":"'Engine 1'!$I23","v":0},{"$f":"'Engine 2'!$I23","v":0},{"$f":"'Engine 3'!$I23","v":0},{"$f":"'Engine 4'!$I23","v":0},{"$f":"'Engine 5'!$I23","v":0},0,50]
{"$rows_left_out":38}
{"sheet":"Permits & Requirements","index":9,"n_rows":46,"n_cols":9,"rows_kept":46,"cut":false,"hidden":false,"merged":[[37,1,37,8],[26,1,26,2],[26,3,26,4],[27,2,27,8],[28,2,28,8],[29,2,30,8],[31,1,33,8],[34,1,35,8],[45,2,45,3],[45,4,45,6],[38,2,38,8],[39,2,39,8],[40,2,40,8],[41,2,41,8],[42,2,42,6],[43,2,43,8],[44,2,44,6],[0,1,0,8],[2,1,4,8],[8,1,8,4],[8,5,16,8],[9,1,9,4],[10,1,12,1],[10,2,12,2],[10,3,12,3],[10,4,12,4],[13,2,14,2],[13,3,14,3],[13,4,14,4],[15,1,16,1],[15,2,16,2],[13,1,14,1],[15,3,16,3],[1,1,1,8],[15,4,16,4],[17,5,17,6],[18,4,23,4],[22,7,23,7],[22,8,23,8],[24,1,24,8],[18,3,22,3],[5,1,6,8],[18,1,19,1],[18,2,19,2],[20,8,21,8],[20,7,21,7],[20,1,21,1],[20,2,21,2],[22,1,23,1],[22,2,23,2],[18,5,19,6],[20,5,21,6],[22,5,23,6],[18,7,19,7],[18,8,19,8]]}
[null,{"$f":"Instructions!O4","v":"p-sbap5-25  •  9/3/19"}]
[null,"Permits and requirements"]
[null,"The need for a permit is based on your entire business's potential air emissions. All activities that put pollutants into the air (including paint and solvent use, woodworking, metalworking) need to be assessed in addition to the engines included in this calculator. Once you determine if you need a permit, based on whether an NSPS applies and your total potential emissions, you can then use your actual emissions to see which permit is the best fit for your business."]
[]
[]
[null,"Content below is based on the information entered into this calculator and is not an official MPCA permit determination."]
[]
[]
[null,"Is a permit required?",null,null,null,"What type of permit?\nAssumes all air pollutant activities are entered into this calculator.\nIf you have additional air emission sources, the recommendation below cannot be used. You must assess your facility's total potential emissions from all sources to identify your permitting needs."]
[null,"The summary below is based on information you entered in the blue tabs. "]
{"$rows_left_out":37}
{"sheet":"Engine Emission Factors","index":10,"n_rows":54,"n_cols":8,"rows_kept":54,"cut":false,"hidden":false,"merged":[[1,0,1,7],[0,0,0,7],[52,1,52,4]]}
[{"$f":"Instructions!O4","v":"p-sbap5-25  •  9/3/19"}]
["Engine emission factors"]
[null,"RECIPROCATING ENGINES (<600HP) DIESEL (lb/MMBtu)","RECIPROCATING ENGINES (>=600HP) DIESEL (lb/MMBtu)1","TURBINE ENGINES (electrical generation) NATURAL GAS (lb/MMBtu)1","RECIPROCATING GASOLINE (lb/MMBtu)2","RECIPROCATING Natural Gas 4-Stroke  Rich-Burn (lb/MMBtu)","RECIPROCATING Natural Gas 4-Stroke Lean-Burn (lb/MMBtu)","RECIPROCATING Natural Gas 2-Stroke Lean-Burn (lb/MMBtu)"]
["source","AP42 Chpt 3.3 (10/96)","AP42 Chpt 3.4 (10/96)","AP42 Chpt 3.1 (4/00)","AP42 Chpt 3.3 (10/96)","AP42 Chpt 3.2-3 (7/00)","AP42 Chpt 3.2-2 (7/00)","AP42 Chpt 3.2-2 (7/00)"]
["PM",0.31,0.1,6.6E-3,0.1,{"$f":"0.0095+0.00991","v":1.941E-2},{"$f":"0.0000771+0.00991","v":9.9871000000000005E-3},{"$f":"0.0384+0.00991","v":4.8309999999999999E-2}]
["PM10",0.31,{"$f":"0.0496+0.0077","v":5.7299999999999997E-2},{"$f":"0.0019+0.0047","v":6.6E-3},0.1,{"$f":"0.0095+0.00991","v":1.941E-2},{"$f":"G5","v":9.9871000000000005E-3},{"$f":"H5","v":4.8309999999999999E-2}]
["PM2.5",0.31,{"$f":"0.0479+0.0077","v":5.5599999999999997E-2},{"$f":"D6","v":6.6E-3},0.1,{"$f":"F6","v":1.941E-2},{"$f":"G5","v":9.9871000000000005E-3},{"$f":"H6","v":4.8309999999999999E-2}]
["SOx",0.28999999999999998,1.01,0.94,8.4000000000000005E-2,5.8799999999999998E-4,5.8799999999999998E-4,5.8799999999999998E-4]
["NOx",4.41,3.2,0.32,1.63,2.21,4.08,3.17]
["VOC",{"$f":"0.35+0+0.01+0","v":0.36},0.09,2.0999999999999999E-3,{"$f":"2.1+0.09+0.69+0.15","v":3.03},2.9600000000000001E-2,0.11799999999999999,0.12]
{"$rows_left_out":45}
{"sheet":"Data Validation","index":11,"n_rows":40,"n_cols":2,"rows_kept":40,"cut":false,"hidden":true,"merged":[[0,0,0,1],[1,0,1,1]]}
[{"$f":"Instructions!O4","v":"p-sbap5-25  •  9/3/19"}]
["Data Validation"]
[]
["Engines","Equation/reference"]
["Engine and Fuel Type","NSPS applies"]
["Choose one",{"$f":"SUM(B7:B8)","v":0}]
["Reciprocating - diesel",{"$f":"COUNTIF('Federal Standards'!N15,\"Yes\")","v":0}]
["Reciprocating - gasoline"]
["Turbine - natural gas"]
["Recip - nat gas 4-stroke rich burn","NSPS no selection"]
{"$rows_left_out":30}