{"text_format":"1","workbook":"xlsx","n_sheets":13,"sheets":["Instructions","Federal standards","State general permit","Aggregate","Crusher engine","Generator","Fugitive","Potential emissions","Actual emissions","Permits & requirements","Aggregate emission factors","Engine Emission Factors","Data validation"],"not_rendered":{"charts":0,"images":2,"macros":1,"external_links":0,"defined_names":33,"comments":1,"pivot_tables":0},"unopened":[],"bounds":{"document_bytes":16777216,"sheet_cells":100000,"rows_first":2000,"rows_last":500,"rows_between":2000,"halvings":0,"cell_chars":16384,"cell_head_chars":4096},"cells_cut":0,"cells_raw":0,"read":"whole","date_system":"1900"}

{"sheet":"Instructions","index":0,"n_rows":28,"n_cols":7,"rows_kept":28,"cut":false,"hidden":false,"merged":[[27,1,27,5],[24,4,24,14],[26,6,26,14],[13,2,13,14],[18,1,18,13],[19,1,19,13],[17,2,17,14],[25,1,25,2],[21,1,21,14],[22,1,22,14],[23,2,23,3],[24,2,24,3],[23,5,23,8],[27,6,27,14],[14,2,14,14],[15,2,15,14],[16,2,16,14],[20,1,20,14],[12,2,12,14],[4,1,4,14],[0,6,0,14],[1,6,3,14],[0,1,3,5],[11,1,11,14],[5,1,5,14],[6,1,6,14],[7,1,7,14],[8,1,8,14],[9,1,10,14]]}
[null,null,null,null,null,null,"Aggregate: sand and gravel\nair emissions calculator"]
[null,null,null,null,null,null,"p-sbap5-30 •  4/22/19"]
[]
[]
[null,"Instructions"]
[null,"1) Begin with the first blue tab across the bottom to enter information for your business."]
[null,"2) The green tab totals all potential and actual emissions from the information entered on the blue tabs."]
[null,"3) The yellow 'Permits & Requirements' tab will help you decide which permit to apply for. "]
[null,"4) Later, you can use the blue tabs to calculate your actual emissions for the air emission inventory, a report due annually if you have an air permit. "]
[]
{"$rows_left_out":19}
{"sheet":"Federal standards","index":1,"n_rows":79,"n_cols":14,"rows_kept":79,"cut":false,"hidden":false,"merged":[[52,13,53,14],[49,2,49,12],[2,1,2,14],[3,1,5,7],[29,1,29,12],[30,2,30,7],[30,9,30,12],[31,2,31,8],[31,9,31,12],[32,1,32,12],[44,13,45,14],[3,8,5,14],[47,1,47,12],[47,13,47,14],[6,2,6,13],[6,14,11,14],[0,1,0,14],[34,2,34,12],[38,1,38,12],[38,13,38,14],[39,1,39,12],[15,13,15,14],[15,1,15,12],[16,13,19,14],[1,1,1,14],[18,2,18,12],[25,4,25,8],[33,2,33,12],[35,1,35,12],[34,13,35,14],[7,2,9,13],[10,2,12,13],[62,9,62,12],[60,1,60,12],[63,2,63,12],[64,2,64,12],[79,1,79,14],[74,1,75,1],[70,1,70,14],[77,1,77,14],[78,1,78,7],[78,8,78,9],[78,10,78,12],[78,13,78,14],[71,1,72,14],[73,2,73,14],[74,2,75,14],[76,2,76,14],[43,1,43,12],[40,2,40,12],[41,2,41,12],[29,13,33,14],[28,1,28,12],[28,13,28,14],[52,1,52,12],[53,1,54,12],[66,2,66,12],[67,2,67,12],[65,1,65,12],[57,1,57,14],[58,1,58,14],[55,1,55,14],[65,13,67,14],[59,1,59,14],[60,13,60,14],[61,1,61,12],[56,2,56,5],[56,6,56,12],[61,13,64,14],[62,2,62,7],[20,13,21,14],[13,1,13,14],[23,1,23,12],[14,1,14,14],[50,1,50,12],[48,13,51,14],[51,8,51,12],[48,1,48,12],[51,2,51,7],[46,1,46,14],[36,1,36,14],[37,1,37,14],[26,1,26,14],[27,1,27,14],[39,13,43,14],[44,8,44,11],[7,1,8,1],[19,2,19,12],[16,1,17,12],[20,1,22,12],[24,4,24,6]]}
[null,{"$f":"Instructions!G2","v":"p-sbap5-30 •  4/22/19"}]
[null,"U.S. Environmental Protection Agency (EPA) standards"]
[]
[null,"New source performance standards (NSPS) require new emission sources to be less polluting than older sources.",null,null,null,null,null,null,"National emission standards for hazardous air pollutants (NESHAP) prevent or reduce emissions that have health impacts."]
[]
[]
[null,"▪ ","Each NSPS or NESHAP applies to specific equipment, processes, or industries. "]
[null,"▪ ","Multiple federal standards may apply to your business. It is possible that if you make a change at your business, a federal standard that did not previously apply now will, or the one you are already following may have additional requirements. A NESHAP can impose requirements on existing equipment without any changes at the facility."]
[]
[]
{"$rows_left_out":70}
{"sheet":"State general permit","index":2,"n_rows":44,"n_cols":14,"rows_kept":44,"cut":false,"hidden":false,"merged":[[33,1,33,14],[30,2,30,14],[31,3,31,14],[44,1,44,14],[43,3,43,8],[42,2,42,14],[41,1,41,14],[34,1,36,14],[37,3,37,8],[38,3,38,6],[39,3,39,8],[40,1,40,14],[37,9,38,13],[39,9,39,13],[32,2,32,12],[0,1,0,14],[1,1,1,14],[29,1,29,12],[29,13,29,14],[7,9,7,11],[2,1,2,14],[7,4,7,5],[4,2,4,14],[6,1,6,14],[7,6,7,7],[10,5,10,13],[10,2,10,4],[24,2,27,4],[11,2,13,4],[14,2,19,4],[9,1,9,14],[3,2,3,10],[3,11,3,12],[8,1,8,14],[28,1,28,14],[24,5,25,13],[11,5,13,13],[26,5,27,13],[14,5,15,13],[16,6,17,13],[18,6,19,13],[20,2,20,4],[20,5,21,13],[22,6,23,13]]}
[null,{"$f":"Instructions!G2","v":"p-sbap5-30 •  4/22/19"}]
[null,"State rules for aggregate processing"]
[null,"An air permit is required if"]
[null,"1)","one or more federal performance standard applies, excluding those listed in Minn. R. 7007.0300, or",null,null,null,null,null,null,null,null,"Minn. R. 7007.0300"]
[null,"2)","your business' overall potential air emissions exceed permit thresholds."]
[]
[null,"On the federal standards tab, you indicated that the following performance standards apply:"]
[null,null,null,null,{"$f":"IF('Federal standards'!$N$16=\"Yes\",\"NSPS OOO\",\" \")","v":" "},null,{"$f":"IF('Federal standards'!$N$29=\"Yes\",\"NSPS IIII or JJJJ\",\" \")","v":" "},null,{"$f":"IF('Federal standards'!$N$39=\"Yes\",\"NSPS Kb\",\" \")","v":" "},{"$f":"IF('Federal standards'!$N$48=\"Yes\",\"NSPS UUU/other NSPS\",\" \")","v":" "}]
[null,{"$f":"IF(OR('Federal standards'!$N$16=\"Choose Y/N\",OR('Federal standards'!$N$29=\"Choose Y/N\",OR('Federal standards'!$N$39=\"Choose Y/N\",'Federal standards'!$N$48=\"Choose Y/N\"))),\"Return to the federal standards tab and answer all Y/N questions.\",\" \")","v":"Return to the federal standards tab and answer all Y/N questions."}]
[]
{"$rows_left_out":35}
{"sheet":"Aggregate","index":3,"n_rows":54,"n_cols":11,"rows_kept":54,"cut":false,"hidden":false,"merged":[[53,1,53,9],[45,1,48,1],[49,1,50,1],[51,1,51,2],[23,4,24,4],[41,8,42,8],[41,9,42,9],[41,1,44,2],[41,3,42,3],[41,4,42,4],[41,5,42,5],[41,6,42,6],[41,7,42,7],[40,1,40,2],[23,10,24,10],[23,1,26,2],[39,1,39,9],[36,1,36,9],[37,1,37,9],[38,1,38,10],[23,3,24,3],[22,1,22,2],[27,1,30,1],[31,1,32,1],[33,1,33,2],[35,1,35,9],[23,5,24,5],[23,6,24,6],[23,7,24,7],[23,8,24,8],[23,9,24,9],[20,1,20,4],[17,1,18,10],[14,1,14,10],[1,1,1,10],[0,1,0,10],[4,2,4,4],[5,2,5,4],[4,6,4,7],[20,6,20,8],[15,1,15,9],[16,1,16,10],[7,2,7,4],[8,2,8,4],[5,6,6,7],[7,6,7,7],[10,2,12,9],[2,1,2,10],[4,9,4,10],[5,9,5,10],[6,9,6,10],[6,2,6,4]]}
[null,{"$f":"Instructions!G2","v":"p-sbap5-30 •  4/22/19"}]
[null,"Air emissions for aggregates: sand and gravel"]
[null,"For the aggregate activities, use the following parameters."]
[]
[null,"Crushing","Aggregate output diameter ",null,null,"Screening","Occurring between crushers…",null,null,"Keep records"]
[null,"Primary","3 to 12 inches",null,null,"Screening","Primary to Secondary & \nSecondary to Tertiary",null,null,"Use the Compliance Calendar"]
[null,"Secondary","2.5 to 10 inches",null,null,null,null,null,null," for Aggregate Facilities"]
[null,"Tertiary","0.5 to 2.5 centimeters (3/16 to 1 inch)",null,null,"Fines ","Tertiary to Fines & Fines"]
[null,"Fines","maximum of 0.5 centimeters (3/16 inch)"]
[]
{"$rows_left_out":45}
{"sheet":"Crusher engine","index":4,"n_rows":62,"n_cols":11,"rows_kept":62,"cut":false,"hidden":false,"merged":[[61,1,61,4],[61,5,61,6],[14,10,15,10],[16,10,17,10],[32,6,32,8],[59,1,59,4],[59,5,60,8],[60,1,60,4],[11,1,11,8],[12,1,12,8],[14,1,15,1],[14,2,15,2],[14,3,15,3],[14,4,15,4],[14,5,15,5],[14,6,15,6],[14,7,15,7],[14,8,15,8],[8,1,8,3],[8,5,8,8],[9,1,9,3],[9,5,9,8],[10,1,10,3],[10,5,10,8],[5,1,5,3],[5,5,5,8],[6,1,6,3],[6,5,6,8],[7,1,7,3],[7,5,7,8],[0,1,0,10],[1,1,1,10],[2,1,2,8],[4,1,4,3],[4,4,4,5],[4,6,4,7]]}
[null,{"$f":"Instructions!G2","v":"p-sbap5-30 •  4/22/19"}]
[null,"Air emissions from the aggregate crusher internal combustion engine"]
[null,"Reciprocating internal combustion engine (RICE)"]
[]
[null,"Engine and fuel type",null,null,"Choose one",null,"Facility identifier for engine",null,"Crusher"]
[null,"Engine use",null,null,"Choose one","If emergency engine is used for peak-shaving or contracted for >15 hr/yr, choose 'Routine.'"]
[null,{"$f":"IF(E5='Data validation'!B6,\" \",IF(OR(E5=rd,E5=rg),\"Rated mechanical output\",IF(OR(E5=ngl,OR(E5=ngr,OR(E5=tng,E5=ng2l))),\"Rated fuel input\",\" \")))","v":" "},null,null,0,{"$f":"IF(B7=\" \",\" \",IF(B7=\"Rated mechanical output\",'Data validation'!B21,IF(B7=\"Rated fuel input\",'Data validation'!B22)))","v":" "}]
[null,"Choose one to calculate actual emissions",null,null,0,{"$f":"IF(B8='Data validation'!C5,\" \",IF(B8='Data validation'!C6,'Data validation'!C11,IF(AND(B8='Data validation'!C7,OR(E5=tng,OR(E5=ngl,OR(E5=ngr,OR(E5=ng2l))))),'Data validation'!C12,IF(AND(B8='Data validation'!C7,OR(E5=rd,OR(E5=rg))),'Data validation'!C13,\" \"))))","v":" "}]
[null,{"$f":"IF(F7=\" \",\" \",IF(F7='Data validation'!B21,'Data validation'!B25,IF(F7='Data validation'!B22,'Data validation'!B26)))","v":" "},null,null,{"$f":"IF(E5='Data validation'!A6,\" \",IF(E5=rd,'Engine Emission Factors'!F48,IF(E5=rg,'Engine Emission Factors'!F49,IF(OR(E5=ngl,OR(E5=ngr,OR(E5=tng,E5=ng2l))),'Engine Emission Factors'!G47,\" \"))))","v":" "},{"$f":"IF(B9=\" \",\" \",IF(B9='Data validation'!B25,\"(Btu/HP-hr)\",IF(B9='Data validation'!B26,\"Btu/scf\")))","v":" "}]
[null,{"$f":"IF(E5='Data validation'!B6,\" \",IF(E5=rd,\"Heat value of fuel\",IF(E5=rg,\"Heat value of fuel\",\" \")))","v":" "},null,"Heat value of fuel",{"$f":"IF(E5=rd,'Engine Emission Factors'!H48,IF(E5=rg,'Engine Emission Factors'!H49,\" \"))","v":" "},{"$f":"IF(E5='Data validation'!B6,\" \",IF(E5=rd,\"(Btu/gal)\",IF(E5=rg,\"(Btu/gal)\",\" \")))","v":" "}]
{"$rows_left_out":53}
{"sheet":"Generator","index":5,"n_rows":62,"n_cols":11,"rows_kept":62,"cut":false,"hidden":false,"merged":[[61,1,61,4],[61,5,61,6],[27,6,27,8],[14,10,15,10],[16,10,17,10],[32,6,32,8],[59,1,59,4],[59,5,60,8],[60,1,60,4],[11,1,11,8],[12,1,12,8],[14,1,15,1],[14,2,15,2],[14,3,15,3],[14,4,15,4],[14,5,15,5],[14,6,15,6],[14,7,15,7],[14,8,15,8],[8,1,8,3],[8,5,8,8],[9,1,9,3],[9,5,9,8],[10,1,10,3],[10,5,10,8],[5,1,5,3],[5,5,5,8],[6,1,6,3],[6,5,6,8],[7,1,7,3],[7,5,7,8],[0,1,0,10],[1,1,1,10],[2,1,2,8],[4,1,4,3],[4,4,4,5],[4,6,4,7]]}
[null,{"$f":"Instructions!G2","v":"p-sbap5-30 •  4/22/19"}]
[null,"Air emissions from the generator"]
[null,"Reciprocating internal combustion engine (RICE)"]
[]
[null,"Engine and fuel type",null,null,"Choose one",null,"Facility identifier for engine",null,"Generator"]
[null,"Engine use",null,null,"Choose one","If emergency engine is used for peak-shaving or contracted for >15 hr/yr, choose 'Routine.'"]
[null,{"$f":"IF(E5='Data validation'!B6,\" \",IF(OR(E5=rd,E5=rg),\"Rated mechanical output\",IF(OR(E5=ngl,OR(E5=ngr,OR(E5=tng,E5=ng2l))),\"Rated fuel input\",\" \")))","v":" "},null,null,0,{"$f":"IF(B7=\" \",\" \",IF(B7=\"Rated mechanical output\",'Data validation'!B21,IF(B7=\"Rated fuel input\",'Data validation'!B22)))","v":" "}]
[null,"Choose one to calculate actual emissions",null,null,0,{"$f":"IF(B8='Data validation'!C5,\" \",IF(B8='Data validation'!C6,'Data validation'!C11,IF(AND(B8='Data validation'!C7,OR(E5=tng,OR(E5=ngl,OR(E5=ngr,OR(E5=ng2l))))),'Data validation'!C12,IF(AND(B8='Data validation'!C7,OR(E5=rd,OR(E5=rg))),'Data validation'!C13,\" \"))))","v":" "}]
[null,{"$f":"IF(F7=\" \",\" \",IF(F7='Data validation'!B21,'Data validation'!B25,IF(F7='Data validation'!B22,'Data validation'!B26)))","v":" "},null,null,{"$f":"IF(E5='Data validation'!A6,\" \",IF(E5=rd,'Engine Emission Factors'!F48,IF(E5=rg,'Engine Emission Factors'!F49,IF(OR(E5=ngl,OR(E5=ngr,OR(E5=tng,E5=ng2l))),'Engine Emission Factors'!G47,\" \"))))","v":" "},{"$f":"IF(B9=\" \",\" \",IF(B9='Data validation'!B25,\"(Btu/HP-hr)\",IF(B9='Data validation'!B26,\"Btu/scf\")))","v":" "}]
[null,{"$f":"IF(E5='Data validation'!B6,\" \",IF(E5=rd,\"Heat value of fuel\",IF(E5=rg,\"Heat value of fuel\",\" \")))","v":" "},null,"Heat value of fuel",{"$f":"IF(E5=rd,'Engine Emission Factors'!H48,IF(E5=rg,'Engine Emission Factors'!H49,\" \"))","v":" "},{"$f":"IF(E5='Data validation'!B6,\" \",IF(E5=rd,\"(Btu/gal)\",IF(E5=rg,\"(Btu/gal)\",\" \")))","v":" "}]
{"$rows_left_out":53}
{"sheet":"Fugitive","index":6,"n_rows":79,"n_cols":9,"rows_kept":79,"cut":false,"hidden":false,"merged":[[62,2,62,3],[62,4,62,5],[62,6,62,7],[63,2,63,3],[63,4,63,5],[48,1,48,2],[40,1,40,2],[41,1,41,2],[43,1,43,8],[45,4,45,8],[48,4,48,7],[47,5,47,7],[46,1,46,2],[40,4,40,7],[41,4,41,7],[47,1,47,2],[44,1,44,2],[42,1,42,8],[45,1,45,2],[46,4,46,7],[50,1,50,8],[59,1,59,8],[49,1,49,8],[51,8,55,8],[52,2,52,3],[52,4,52,5],[52,6,52,7],[51,2,51,3],[51,4,51,5],[51,6,51,7],[51,1,53,1],[29,4,29,7],[44,4,44,8],[28,4,28,7],[31,5,31,8],[33,1,33,2],[39,4,39,7],[38,1,38,2],[39,1,39,2],[38,4,38,8],[35,1,35,8],[34,1,34,2],[36,1,36,8],[0,1,0,8],[1,1,1,8],[2,1,2,8],[37,1,37,2],[21,1,21,8],[34,6,34,7],[22,1,22,8],[33,4,33,7],[32,1,32,2],[32,4,32,7],[24,5,24,7],[25,5,25,7],[26,5,26,7],[30,1,30,2],[27,1,27,2],[29,1,29,2],[20,1,20,8],[6,2,6,8],[10,1,10,8],[18,4,19,8],[18,2,18,3],[7,2,7,3],[7,4,8,8],[17,1,17,8],[74,7,80,8],[53,6,53,7],[53,2,53,3],[53,4,53,5],[73,5,73,8],[74,1,74,5],[72,5,72,8],[71,4,71,8],[78,1,78,6],[77,1,77,2],[75,3,75,6],[75,1,75,2],[76,1,76,6],[77,3,77,6],[70,2,70,3],[70,6,70,7],[63,6,63,7],[61,8,65,8],[61,1,63,1],[64,1,65,1],[61,2,61,3],[61,4,61,5],[61,6,61,7],[60,1,60,8],[4,1,5,8],[3,1,3,8],[9,1,9,8],[11,1,11,8],[12,2,12,3],[13,1,14,1],[13,2,14,3],[13,4,16,7],[15,1,16,1],[15,2,16,3]]}
[null,{"$f":"Instructions!G2","v":"p-sbap5-30 •  4/22/19"}]
[null,"Air emissions from fugitive sources"]
[null,"Fugitive emissions1"]
[null,"Potential emissions"]
[null,"Your potential emissions from fugitive sources must be used in identifying whether a permit is required. Fugitive sources include unpaved roads, material handling at stockpiles, and wind erosion of ground piles. "]
[]
[]
[null,null,"Throughput  (maximum capacity) ",null,"<-------- The maximum throughput used on the aggregate tab for potential emissions is automatically entered here."]
[null,null,{"$f":"SUM(Aggregate!E28:E34)","v":0},"tons/year"]
[]
{"$rows_left_out":70}
{"sheet":"Potential emissions","index":7,"n_rows":48,"n_cols":8,"rows_kept":48,"cut":false,"hidden":false,"merged":[[46,2,46,3],[0,1,0,7],[1,1,1,7],[2,1,2,7],[3,2,4,2],[3,3,4,3],[3,4,4,4],[3,5,4,5],[3,6,4,6],[3,7,4,7],[3,1,5,1]]}
[null,{"$f":"Instructions!G2","v":"p-sbap5-30 •  4/22/19"}]
[null,"Potential emissions - Aggregate: sand & gravel"]
[null,{"$f":"IF('Data validation'!A22=\"yes\",\"The flag next to a potential emission total means your potential emissions exceed the permitting threshold and a permit is required.\",\"These pollutant totals represent the information you entered into this calculator.\")","v":"These pollutant totals represent the information you entered into this calculator."}]
[null,"Pollutant","Aggregate","Crusher Engine","Generator","Fugitives","Potential Emissions","Permitting Threshold"]
[]
[null,null,"(ton/yr)","(ton/yr)","(ton/yr)","(ton/yr)","(ton/yr)","(ton/yr)"]
[null,"Criteria Air Pollutants",null,{"$f":"IF('Crusher engine'!J20=7,\"Insignificant Activity\",\" \")","v":" "},{"$f":"IF(Generator!J20=7,\"Insignificant Activity\",\" \")","v":" "}]
[null,"PM",{"$f":"Aggregate!G35","v":0},{"$f":"'Crusher engine'!H20","v":0},{"$f":"Generator!H20","v":0},{"$f":"Fugitive!I57","v":0},{"$f":"SUM(C8:F8)","v":0},100]
[null,"PM10",{"$f":"Aggregate!I35","v":0},{"$f":"'Crusher engine'!H21","v":0},{"$f":"Generator!H21","v":0},{"$f":"Fugitive!I58","v":0},0,25]
[null,"PM2.5",{"$f":"Aggregate!K35","v":0},{"$f":"'Crusher engine'!H22","v":0},{"$f":"Generator!H22","v":0},{"$f":"Fugitive!I59","v":0},0,100]
{"$rows_left_out":39}
{"sheet":"Actual emissions","index":8,"n_rows":48,"n_cols":8,"rows_kept":48,"cut":false,"hidden":false,"merged":[[0,1,0,7],[1,1,1,7],[2,1,2,7],[3,1,5,1],[3,2,4,2],[3,3,4,3],[3,4,4,4],[3,5,4,5],[3,6,4,6],[3,7,4,7]]}
[null,{"$f":"Instructions!G2","v":"p-sbap5-30 •  4/22/19"}]
[null,"Actual emissions - Aggregate: sand & gravel"]
[null,{"$f":"IF('Data validation'!A25=\"yes\",\"The flag next to your actual emissions total indicates that your business exceeds the Option D limit and an individual permit is required.\",\"These pollutant totals represent the information you entered into this calculator.\")","v":"These pollutant totals represent the information you entered into this calculator."}]
[null,"Pollutant","Aggregate","Crusher Engine","Generator","Fugitives","Potential Emissions","Permitting Threshold"]
[]
[null,null,"(ton/yr)","(ton/yr)","(ton/yr)","(ton/yr)","(ton/yr)","(ton/yr)"]
[null,"Criteria Air Pollutants"]
[null,"PM",{"$f":"Aggregate!F53","v":0},{"$f":"'Crusher engine'!I20","v":0},{"$f":"Generator!I20","v":0},{"$f":"Fugitive!I67","v":0},{"$f":"SUM(C8:F8)","v":0},50]
[null,"PM10",{"$f":"Aggregate!H53","v":0},{"$f":"'Crusher engine'!I21","v":0},{"$f":"Generator!I21","v":0},{"$f":"Fugitive!I68","v":0},0,50]
[null,"PM2.5",{"$f":"Aggregate!J53","v":0},{"$f":"'Crusher engine'!I22","v":0},{"$f":"Generator!I22","v":0},{"$f":"Fugitive!I69","v":0},0,50]
{"$rows_left_out":39}
{"sheet":"Permits & requirements","index":9,"n_rows":62,"n_cols":9,"rows_kept":62,"cut":false,"hidden":false,"merged":[[15,2,16,2],[15,3,16,3],[15,4,16,4],[17,1,19,1],[17,2,19,2],[17,3,19,3],[17,4,19,4],[0,1,0,8],[1,1,1,8],[2,1,4,8],[5,1,6,8],[8,1,8,4],[8,5,16,8],[9,1,9,4],[10,1,11,1],[10,2,11,2],[10,3,11,3],[10,4,11,4],[12,1,14,1],[12,2,14,2],[12,3,14,3],[12,4,14,4],[15,1,16,1],[17,5,19,6],[17,7,19,7],[17,8,19,8],[20,4,25,4],[20,5,20,6],[21,5,21,6],[21,7,23,7],[21,8,23,8],[24,7,25,7],[24,8,25,8],[40,1,40,2],[40,3,40,4],[41,2,41,8],[26,8,29,8],[34,1,34,6],[35,2,37,3],[35,4,37,5],[38,2,38,3],[38,4,38,5],[42,2,42,8],[43,2,44,8],[45,1,47,8],[48,1,48,8],[50,1,50,2],[50,3,50,4],[51,1,51,5],[52,1,52,5],[53,1,53,4],[54,1,54,4],[56,1,56,8],[57,1,57,5],[58,1,58,5],[59,1,59,5],[60,1,60,5],[61,1,61,2],[61,3,61,5],[20,1,21,1],[20,2,21,2],[32,1,33,8],[31,1,31,8],[22,1,23,1],[22,2,23,2],[24,1,25,1],[24,2,25,2],[26,1,29,7],[24,5,25,6],[22,5,23,6]]}
[null,{"$f":"Instructions!G2","v":"p-sbap5-30 •  4/22/19"}]
[null,"Permits & requirements"]
[null,"The need for a permit is based on your entire business' potential air emissions. All activities that put pollutants into the air (such as paint and solvent use that are not associated with maintenance) need to be assessed if they are not included in this calculator. Once you identify if you need a permit, based on whether an NSPS applies and potential emissions, you can then use your actual emissions to see which permit is the best fit for your business."]
[]
[]
[null,"Content below is based on the information entered into this calculator and is not an official MPCA permit determination."]
[]
[]
[null,"Is a permit required?",null,null,null,"What type of permit?\nAssumes all air pollutant activities are entered into this calculator.\nIf you have additional air emission sources, the recommendation below cannot be used. You must assess your facility's total potential emissions from all sources to identify your permitting needs."]
[null,"The summary below is based on information you entered in the blue tabs. "]
{"$rows_left_out":53}
{"sheet":"Aggregate emission factors","index":10,"n_rows":42,"n_cols":10,"rows_kept":42,"cut":false,"hidden":false,"merged":[[24,1,26,9],[30,2,30,9],[27,1,29,9],[41,1,41,2],[39,1,40,1],[32,1,32,9],[33,1,34,2],[35,1,38,1],[35,6,36,9],[37,6,38,9],[33,3,33,4],[39,6,40,9],[33,5,34,9],[15,2,16,2],[19,7,20,7],[21,7,22,7],[17,2,18,2],[19,2,20,2],[23,6,23,9],[23,1,23,5],[1,1,1,9],[3,1,3,9],[13,7,14,7],[15,7,16,7],[17,7,18,7],[13,9,14,9],[15,9,16,9],[17,9,18,9],[4,3,8,3],[4,4,7,4],[4,5,7,5],[4,6,7,6],[19,9,20,9],[21,9,22,9],[4,9,7,9],[4,1,8,2],[0,1,0,9],[21,1,22,2],[13,5,14,5],[15,5,16,5],[17,5,18,5],[19,5,20,5],[21,5,22,5],[17,1,20,1],[9,1,16,1],[9,2,10,2],[11,2,12,2],[13,2,14,2],[4,7,7,7],[4,8,7,8]]}
[null,{"$f":"Instructions!G2","v":"p-sbap5-30 •  4/22/19"}]
[null,"Emission factors for aggregate processing1"]
[]
[null,"Emission factors and calculated percent controls"]
[null,"Activity",null,"Uncontrolled or Controlled Emission Factor","PM Emission Factor","PM Emission Control (calculated)","PM10 Emission Factor","PM10 Emission Control (calculated)","PM2.5 Emission Factor","PM2.5 Emission Control"]
[]
[]
[]
[null,null,null,null,"(lb/ton)","(%)","(lb/ton)","(%)","(lb/ton)","(%)"]
[null,"Crushing","Primary1","Uncontrolled",6.9999999999999999E-4,null,{"$f":"E10","v":6.9999999999999999E-4},null,"ND"]
{"$rows_left_out":33}
{"sheet":"Engine Emission Factors","index":11,"n_rows":54,"n_cols":8,"rows_kept":54,"cut":false,"hidden":false,"merged":[[0,0,0,7],[1,0,1,7],[52,1,52,4]]}
[{"$f":"Instructions!G2","v":"p-sbap5-30 •  4/22/19"}]
["Engine emission factors"]
[null,"RECIPROCATING ENGINES (<600HP) DIESEL (lb/MMBtu)","RECIPROCATING ENGINES (>=600HP) DIESEL (lb/MMBtu)1","TURBINE ENGINES (electrical generation) NATURAL GAS (lb/MMBtu)1","RECIPROCATING GASOLINE (lb/MMBtu)2","RECIPROCATING Natural Gas 4-Stroke  Rich-Burn (lb/MMBtu)","RECIPROCATING Natural Gas 4-Stroke Lean-Burn (lb/MMBtu)","RECIPROCATING Natural Gas 2-Stroke Lean-Burn (lb/MMBtu)"]
["source","AP42 Chpt 3.3 (10/96)","AP42 Chpt 3.4 (10/96)","AP42 Chpt 3.1 (4/00)","AP42 Chpt 3.3 (10/96)","AP42 Chpt 3.2-3 (7/00)","AP42 Chpt 3.2-2 (7/00)","AP42 Chpt 3.2-2 (7/00)"]
["PM",0.31,0.1,6.6E-3,0.1,{"$f":"0.0095+0.00991","v":1.941E-2},{"$f":"0.0000771+0.00991","v":9.9871000000000005E-3},{"$f":"0.0384+0.00991","v":4.8309999999999999E-2}]
["PM10",0.31,{"$f":"0.0496+0.0077","v":5.7299999999999997E-2},{"$f":"0.0019+0.0047","v":6.6E-3},0.1,{"$f":"0.0095+0.00991","v":1.941E-2},{"$f":"G5","v":9.9871000000000005E-3},{"$f":"H5","v":4.8309999999999999E-2}]
["PM2.5",0.31,{"$f":"0.0479+0.0077","v":5.5599999999999997E-2},{"$f":"D6","v":6.6E-3},0.1,{"$f":"F6","v":1.941E-2},{"$f":"G5","v":9.9871000000000005E-3},{"$f":"H6","v":4.8309999999999999E-2}]
["SOx",0.28999999999999998,1.01,0.94,8.4000000000000005E-2,5.8799999999999998E-4,5.8799999999999998E-4,5.8799999999999998E-4]
["NOx",4.41,3.2,0.32,1.63,2.21,4.08,3.17]
["VOC",{"$f":"0.35+0+0.01+0","v":0.36},0.09,2.0999999999999999E-3,{"$f":"2.1+0.09+0.69+0.15","v":3.03},2.9600000000000001E-2,0.11799999999999999,0.12]
{"$rows_left_out":45}
{"sheet":"Data validation","index":12,"n_rows":26,"n_cols":3,"rows_kept":26,"cut":false,"hidden":true,"merged":[[0,0,0,2],[1,0,1,2]]}
[{"$f":"Instructions!G2","v":"p-sbap5-30 •  4/22/19"}]
["Data validation"]
[]
["General data","Engines"]
["Selection","Engine and fuel type","Choose one to calculate actual emissions"]
["Choose Y/N","Choose one","Number of hours operated per 12 months"]
["Yes","Reciprocating - diesel","Quantity of fuel actually burned per 12 months"]
["No","Reciprocating - gasoline"]
[null,"Turbine - natural gas"]
["Equation/reference","Recip - nat gas 4-stroke rich burn","Actual emissions entry"]
{"$rows_left_out":16}